AnsweredAssumed Answered

Error when clicking on 'Recently Modififed' in Data List

Question asked by andreas.wilmsmeier on Apr 18, 2010
Latest reply on Apr 18, 2010 by andreas.wilmsmeier
Hi,
when clicking on "Recently Modified" in a data list, I see an error message displayed in the data list. Checking the log, I see a number of error message (see below).
I'm running ALfresco version 3.3.0 (G 2785) schema 4009.
Anybody having this problem?
Andreas


09:54:18,822  ERROR [extensions.webscripts.AbstractRuntime] Exception from executeScript - redirecting to status template error: 03180001 Wrapped Exception (with status template): 03180168 Failed to execute script 'classpath*:alfresco/templates/webscripts/org/alfresco/slingshot/datalists/data.post.json.js': 03180167 TypeError: Cannot find function indexOf. (file:/opt/Alfresco/tomcat/webapps/alfresco/WEB-INF/classes/alfresco/templates/webscripts/org/alfresco/slingshot/datalists/data.post.json.js#304)
org.springframework.extensions.webscripts.WebScriptException: 03180001 Wrapped Exception (with status template): 03180168 Failed to execute script 'classpath*:alfresco/templates/webscripts/org/alfresco/slingshot/datalists/data.post.json.js': 03180167 TypeError: Cannot find function indexOf. (file:/opt/Alfresco/tomcat/webapps/alfresco/WEB-INF/classes/alfresco/templates/webscripts/org/alfresco/slingshot/datalists/data.post.json.js#304)
   at org.springframework.extensions.webscripts.AbstractWebScript.createStatusException(AbstractWebScript.java:731)
   at org.springframework.extensions.webscripts.DeclarativeWebScript.execute(DeclarativeWebScript.java:167)
   at org.alfresco.repo.web.scripts.RepositoryContainer$2.execute(RepositoryContainer.java:367)
   at org.alfresco.repo.transaction.RetryingTransactionHelper.doInTransaction(RetryingTransactionHelper.java:321)
   at org.alfresco.repo.web.scripts.RepositoryContainer.transactionedExecute(RepositoryContainer.java:417)
   at org.alfresco.repo.web.scripts.RepositoryContainer.transactionedExecuteAs(RepositoryContainer.java:434)
   at org.alfresco.repo.web.scripts.RepositoryContainer.executeScript(RepositoryContainer.java:298)
   at org.springframework.extensions.webscripts.AbstractRuntime.executeScript(AbstractRuntime.java:319)
   at org.springframework.extensions.webscripts.AbstractRuntime.executeScript(AbstractRuntime.java:178)
   at org.springframework.extensions.webscripts.servlet.WebScriptServlet.service(WebScriptServlet.java:116)
   at javax.servlet.http.HttpServlet.service(HttpServlet.java:717)
   at org.apache.catalina.core.ApplicationFilterChain.internalDoFilter(ApplicationFilterChain.java:290)
   at org.apache.catalina.core.ApplicationFilterChain.doFilter(ApplicationFilterChain.java:206)
   at org.apache.catalina.core.StandardWrapperValve.invoke(StandardWrapperValve.java:233)
   at org.apache.catalina.core.StandardContextValve.invoke(StandardContextValve.java:191)
   at org.apache.catalina.core.StandardHostValve.invoke(StandardHostValve.java:128)
   at org.apache.catalina.valves.ErrorReportValve.invoke(ErrorReportValve.java:102)
   at org.apache.catalina.core.StandardEngineValve.invoke(StandardEngineValve.java:109)
   at org.apache.catalina.connector.CoyoteAdapter.service(CoyoteAdapter.java:286)
   at org.apache.coyote.http11.Http11Processor.process(Http11Processor.java:845)
   at org.apache.coyote.http11.Http11Protocol$Http11ConnectionHandler.process(Http11Protocol.java:583)
   at org.apache.tomcat.util.net.JIoEndpoint$Worker.run(JIoEndpoint.java:447)
   at java.lang.Thread.run(Thread.java:619)
Caused by: org.alfresco.scripts.ScriptException: 03180168 Failed to execute script 'classpath*:alfresco/templates/webscripts/org/alfresco/slingshot/datalists/data.post.json.js': 03180167 TypeError: Cannot find function indexOf. (file:/opt/Alfresco/tomcat/webapps/alfresco/WEB-INF/classes/alfresco/templates/webscripts/org/alfresco/slingshot/datalists/data.post.json.js#304)
   at org.alfresco.repo.jscript.RhinoScriptProcessor.execute(RhinoScriptProcessor.java:183)
   at org.alfresco.repo.processor.ScriptServiceImpl.executeScript(ScriptServiceImpl.java:268)
   at org.alfresco.repo.web.scripts.RepositoryScriptProcessor.executeScript(RepositoryScriptProcessor.java:102)
   at org.springframework.extensions.webscripts.AbstractWebScript.executeScript(AbstractWebScript.java:952)
   at org.springframework.extensions.webscripts.DeclarativeWebScript.execute(DeclarativeWebScript.java:86)
   … 21 more
Caused by: org.alfresco.error.AlfrescoRuntimeException: 03180167 TypeError: Cannot find function indexOf. (file:/opt/Alfresco/tomcat/webapps/alfresco/WEB-INF/classes/alfresco/templates/webscripts/org/alfresco/slingshot/datalists/data.post.json.js#304)
   at org.alfresco.repo.jscript.RhinoScriptProcessor.executeScriptImpl(RhinoScriptProcessor.java:469)
   at org.alfresco.repo.jscript.RhinoScriptProcessor.execute(RhinoScriptProcessor.java:179)
   … 25 more
Caused by: org.mozilla.javascript.EcmaError: TypeError: Cannot find function indexOf. (file:/opt/Alfresco/tomcat/webapps/alfresco/WEB-INF/classes/alfresco/templates/webscripts/org/alfresco/slingshot/datalists/data.post.json.js#304)
   at org.mozilla.javascript.ScriptRuntime.constructError(ScriptRuntime.java:3350)
   at org.mozilla.javascript.ScriptRuntime.constructError(ScriptRuntime.java:3340)
   at org.mozilla.javascript.ScriptRuntime.typeError(ScriptRuntime.java:3356)
   at org.mozilla.javascript.ScriptRuntime.typeError1(ScriptRuntime.java:3368)
   at org.mozilla.javascript.ScriptRuntime.notFunctionError(ScriptRuntime.java:3428)
   at org.mozilla.javascript.ScriptRuntime.getPropFunctionAndThis(ScriptRuntime.java:2052)
   at org.mozilla.javascript.gen.c34._c5(file:/opt/Alfresco/tomcat/webapps/alfresco/WEB-INF/classes/alfresco/templates/webscripts/org/alfresco/slingshot/datalists/data.post.json.js:304)
   at org.mozilla.javascript.gen.c34.call(file:/opt/Alfresco/tomcat/webapps/alfresco/WEB-INF/classes/alfresco/templates/webscripts/org/alfresco/slingshot/datalists/data.post.json.js)
   at org.mozilla.javascript.optimizer.OptRuntime.call2(OptRuntime.java:76)
   at org.mozilla.javascript.gen.c34._c9(file:/opt/Alfresco/tomcat/webapps/alfresco/WEB-INF/classes/alfresco/templates/webscripts/org/alfresco/slingshot/datalists/data.post.json.js:650)
   at org.mozilla.javascript.gen.c34.call(file:/opt/Alfresco/tomcat/webapps/alfresco/WEB-INF/classes/alfresco/templates/webscripts/org/alfresco/slingshot/datalists/data.post.json.js)
   at org.mozilla.javascript.optimizer.OptRuntime.callName0(OptRuntime.java:108)
   at org.mozilla.javascript.gen.c34._c0(file:/opt/Alfresco/tomcat/webapps/alfresco/WEB-INF/classes/alfresco/templates/webscripts/org/alfresco/slingshot/datalists/data.post.json.js:700)
   at org.mozilla.javascript.gen.c34.call(file:/opt/Alfresco/tomcat/webapps/alfresco/WEB-INF/classes/alfresco/templates/webscripts/org/alfresco/slingshot/datalists/data.post.json.js)
   at org.mozilla.javascript.ContextFactory.doTopCall(ContextFactory.java:393)
   at org.mozilla.javascript.ScriptRuntime.doTopCall(ScriptRuntime.java:2834)
   at org.mozilla.javascript.gen.c34.call(file:/opt/Alfresco/tomcat/webapps/alfresco/WEB-INF/classes/alfresco/templates/webscripts/org/alfresco/slingshot/datalists/data.post.json.js)
   at org.mozilla.javascript.gen.c34.exec(file:/opt/Alfresco/tomcat/webapps/alfresco/WEB-INF/classes/alfresco/templates/webscripts/org/alfresco/slingshot/datalists/data.post.json.js)
   at org.alfresco.repo.jscript.RhinoScriptProcessor.executeScriptImpl(RhinoScriptProcessor.java:453)
   … 26 more

Outcomes