AnsweredAssumed Answered

Share 3.4c - Repository error

Question asked by openpj Moderator on Dec 22, 2010
Today I installed Alfresco 3.4c and this version also includes language packs.
Alfresco has created all the default contents (name and title) in italian language, this is cool but I think that now some features of Share don't work for this.

This is the exception returned clicking on Repository in Share after the first installation:
15:18:31,292  ERROR [extensions.webscripts.AbstractRuntime] Exception from executeScript - redirecting to status template error: 11220004 Wrapped Exception (with status template): 11220008 Failed to execute script 'classpath*:alfresco/templates/webscripts/org/alfresco/collaboration/tagQuery.get.js': 11220007 Invalid node ref - does not contain forward slash: null
org.springframework.extensions.webscripts.WebScriptException: 11220004 Wrapped Exception (with status template): 11220008 Failed to execute script 'classpath*:alfresco/templates/webscripts/org/alfresco/collaboration/tagQuery.get.js': 11220007 Invalid node ref - does not contain forward slash: null
   at org.springframework.extensions.webscripts.AbstractWebScript.createStatusException(AbstractWebScript.java:758)
   at org.springframework.extensions.webscripts.DeclarativeWebScript.execute(DeclarativeWebScript.java:171)
   at org.alfresco.repo.web.scripts.RepositoryContainer$2.execute(RepositoryContainer.java:383)
   at org.alfresco.repo.transaction.RetryingTransactionHelper.doInTransaction(RetryingTransactionHelper.java:381)
   at org.alfresco.repo.web.scripts.RepositoryContainer.transactionedExecute(RepositoryContainer.java:436)
   at org.alfresco.repo.web.scripts.RepositoryContainer.transactionedExecuteAs(RepositoryContainer.java:466)
   at org.alfresco.repo.web.scripts.RepositoryContainer.executeScript(RepositoryContainer.java:304)
   at org.springframework.extensions.webscripts.AbstractRuntime.executeScript(AbstractRuntime.java:333)
   at org.springframework.extensions.webscripts.AbstractRuntime.executeScript(AbstractRuntime.java:189)
   at org.springframework.extensions.webscripts.servlet.WebScriptServlet.service(WebScriptServlet.java:118)
   at javax.servlet.http.HttpServlet.service(HttpServlet.java:717)
   at org.apache.catalina.core.ApplicationFilterChain.internalDoFilter(ApplicationFilterChain.java:290)
   at org.apache.catalina.core.ApplicationFilterChain.doFilter(ApplicationFilterChain.java:206)
   at org.alfresco.web.app.servlet.GlobalLocalizationFilter.doFilter(GlobalLocalizationFilter.java:58)
   at org.apache.catalina.core.ApplicationFilterChain.internalDoFilter(ApplicationFilterChain.java:235)
   at org.apache.catalina.core.ApplicationFilterChain.doFilter(ApplicationFilterChain.java:206)
   at org.apache.catalina.core.StandardWrapperValve.invoke(StandardWrapperValve.java:233)
   at org.apache.catalina.core.StandardContextValve.invoke(StandardContextValve.java:191)
   at org.apache.catalina.core.StandardHostValve.invoke(StandardHostValve.java:127)
   at org.apache.catalina.valves.ErrorReportValve.invoke(ErrorReportValve.java:102)
   at org.apache.catalina.core.StandardEngineValve.invoke(StandardEngineValve.java:109)
   at org.apache.catalina.connector.CoyoteAdapter.service(CoyoteAdapter.java:298)
   at org.apache.coyote.http11.Http11Processor.process(Http11Processor.java:857)
   at org.apache.coyote.http11.Http11Protocol$Http11ConnectionHandler.process(Http11Protocol.java:588)
   at org.apache.tomcat.util.net.JIoEndpoint$Worker.run(JIoEndpoint.java:489)
   at java.lang.Thread.run(Thread.java:680)
Caused by: org.alfresco.scripts.ScriptException: 11220008 Failed to execute script 'classpath*:alfresco/templates/webscripts/org/alfresco/collaboration/tagQuery.get.js': 11220007 Invalid node ref - does not contain forward slash: null
   at org.alfresco.repo.jscript.RhinoScriptProcessor.execute(RhinoScriptProcessor.java:194)
   at org.alfresco.repo.processor.ScriptServiceImpl.executeScript(ScriptServiceImpl.java:282)
   at org.alfresco.repo.web.scripts.RepositoryScriptProcessor.executeScript(RepositoryScriptProcessor.java:102)
   at org.springframework.extensions.webscripts.AbstractWebScript.executeScript(AbstractWebScript.java:981)
   at org.springframework.extensions.webscripts.DeclarativeWebScript.execute(DeclarativeWebScript.java:86)
   … 24 more
Caused by: org.alfresco.error.AlfrescoRuntimeException: 11220007 Invalid node ref - does not contain forward slash: null
   at org.alfresco.service.cmr.repository.NodeRef.<init>(NodeRef.java:89)
   at org.alfresco.repo.jscript.Search.findNode(Search.java:151)
   at sun.reflect.NativeMethodAccessorImpl.invoke0(Native Method)
   at sun.reflect.NativeMethodAccessorImpl.invoke(NativeMethodAccessorImpl.java:39)
   at sun.reflect.DelegatingMethodAccessorImpl.invoke(DelegatingMethodAccessorImpl.java:25)
   at java.lang.reflect.Method.invoke(Method.java:597)
   at org.mozilla.javascript.MemberBox.invoke(MemberBox.java:155)
   at org.mozilla.javascript.NativeJavaMethod.call(NativeJavaMethod.java:243)
   at org.mozilla.javascript.optimizer.OptRuntime.call1(OptRuntime.java:66)
   at org.mozilla.javascript.gen.c6._c1(file:/Applications/alfresco/Colacem34b/tomcat6/tomcat/webapps/alfresco/WEB-INF/classes/alfresco/templates/webscripts/org/alfresco/collaboration/tagQuery.get.js:14)
   at org.mozilla.javascript.gen.c6.call(file:/Applications/alfresco/Colacem34b/tomcat6/tomcat/webapps/alfresco/WEB-INF/classes/alfresco/templates/webscripts/org/alfresco/collaboration/tagQuery.get.js)
   at org.mozilla.javascript.optimizer.OptRuntime.callName0(OptRuntime.java:108)
   at org.mozilla.javascript.gen.c6._c0(file:/Applications/alfresco/Colacem34b/tomcat6/tomcat/webapps/alfresco/WEB-INF/classes/alfresco/templates/webscripts/org/alfresco/collaboration/tagQuery.get.js:168)
   at org.mozilla.javascript.gen.c6.call(file:/Applications/alfresco/Colacem34b/tomcat6/tomcat/webapps/alfresco/WEB-INF/classes/alfresco/templates/webscripts/org/alfresco/collaboration/tagQuery.get.js)
   at org.mozilla.javascript.ContextFactory.doTopCall(ContextFactory.java:393)
   at org.mozilla.javascript.ScriptRuntime.doTopCall(ScriptRuntime.java:2834)
   at org.mozilla.javascript.gen.c6.call(file:/Applications/alfresco/Colacem34b/tomcat6/tomcat/webapps/alfresco/WEB-INF/classes/alfresco/templates/webscripts/org/alfresco/collaboration/tagQuery.get.js)
   at org.mozilla.javascript.gen.c6.exec(file:/Applications/alfresco/Colacem34b/tomcat6/tomcat/webapps/alfresco/WEB-INF/classes/alfresco/templates/webscripts/org/alfresco/collaboration/tagQuery.get.js)
   at org.alfresco.repo.jscript.RhinoScriptProcessor.executeScriptImpl(RhinoScriptProcessor.java:472)
   at org.alfresco.repo.jscript.RhinoScriptProcessor.execute(RhinoScriptProcessor.java:190)
   … 28 more
15:18:40,713  ERROR [extensions.webscripts.AbstractRuntime] Exception from executeScript - redirecting to status template error: 11220005 Wrapped Exception (with status template): 11220010 Failed to execute script 'classpath*:alfresco/templates/webscripts/org/alfresco/collaboration/tagQuery.get.js': 11220009 Invalid node ref - does not contain forward slash: null
org.springframework.extensions.webscripts.WebScriptException: 11220005 Wrapped Exception (with status template): 11220010 Failed to execute script 'classpath*:alfresco/templates/webscripts/org/alfresco/collaboration/tagQuery.get.js': 11220009 Invalid node ref - does not contain forward slash: null
   at org.springframework.extensions.webscripts.AbstractWebScript.createStatusException(AbstractWebScript.java:758)
   at org.springframework.extensions.webscripts.DeclarativeWebScript.execute(DeclarativeWebScript.java:171)
   at org.alfresco.repo.web.scripts.RepositoryContainer$2.execute(RepositoryContainer.java:383)
   at org.alfresco.repo.transaction.RetryingTransactionHelper.doInTransaction(RetryingTransactionHelper.java:381)
   at org.alfresco.repo.web.scripts.RepositoryContainer.transactionedExecute(RepositoryContainer.java:436)
   at org.alfresco.repo.web.scripts.RepositoryContainer.transactionedExecuteAs(RepositoryContainer.java:466)
   at org.alfresco.repo.web.scripts.RepositoryContainer.executeScript(RepositoryContainer.java:304)
   at org.springframework.extensions.webscripts.AbstractRuntime.executeScript(AbstractRuntime.java:333)
   at org.springframework.extensions.webscripts.AbstractRuntime.executeScript(AbstractRuntime.java:189)
   at org.springframework.extensions.webscripts.servlet.WebScriptServlet.service(WebScriptServlet.java:118)
   at javax.servlet.http.HttpServlet.service(HttpServlet.java:717)
   at org.apache.catalina.core.ApplicationFilterChain.internalDoFilter(ApplicationFilterChain.java:290)
   at org.apache.catalina.core.ApplicationFilterChain.doFilter(ApplicationFilterChain.java:206)
   at org.alfresco.web.app.servlet.GlobalLocalizationFilter.doFilter(GlobalLocalizationFilter.java:58)
   at org.apache.catalina.core.ApplicationFilterChain.internalDoFilter(ApplicationFilterChain.java:235)
   at org.apache.catalina.core.ApplicationFilterChain.doFilter(ApplicationFilterChain.java:206)
   at org.apache.catalina.core.StandardWrapperValve.invoke(StandardWrapperValve.java:233)
   at org.apache.catalina.core.StandardContextValve.invoke(StandardContextValve.java:191)
   at org.apache.catalina.core.StandardHostValve.invoke(StandardHostValve.java:127)
   at org.apache.catalina.valves.ErrorReportValve.invoke(ErrorReportValve.java:102)
   at org.apache.catalina.core.StandardEngineValve.invoke(StandardEngineValve.java:109)
   at org.apache.catalina.connector.CoyoteAdapter.service(CoyoteAdapter.java:298)
   at org.apache.coyote.http11.Http11Processor.process(Http11Processor.java:857)
   at org.apache.coyote.http11.Http11Protocol$Http11ConnectionHandler.process(Http11Protocol.java:588)
   at org.apache.tomcat.util.net.JIoEndpoint$Worker.run(JIoEndpoint.java:489)
   at java.lang.Thread.run(Thread.java:680)
Caused by: org.alfresco.scripts.ScriptException: 11220010 Failed to execute script 'classpath*:alfresco/templates/webscripts/org/alfresco/collaboration/tagQuery.get.js': 11220009 Invalid node ref - does not contain forward slash: null
   at org.alfresco.repo.jscript.RhinoScriptProcessor.execute(RhinoScriptProcessor.java:194)
   at org.alfresco.repo.processor.ScriptServiceImpl.executeScript(ScriptServiceImpl.java:282)
   at org.alfresco.repo.web.scripts.RepositoryScriptProcessor.executeScript(RepositoryScriptProcessor.java:102)
   at org.springframework.extensions.webscripts.AbstractWebScript.executeScript(AbstractWebScript.java:981)
   at org.springframework.extensions.webscripts.DeclarativeWebScript.execute(DeclarativeWebScript.java:86)
   … 24 more
Caused by: org.alfresco.error.AlfrescoRuntimeException: 11220009 Invalid node ref - does not contain forward slash: null
   at org.alfresco.service.cmr.repository.NodeRef.<init>(NodeRef.java:89)
   at org.alfresco.repo.jscript.Search.findNode(Search.java:151)
   at sun.reflect.NativeMethodAccessorImpl.invoke0(Native Method)
   at sun.reflect.NativeMethodAccessorImpl.invoke(NativeMethodAccessorImpl.java:39)
   at sun.reflect.DelegatingMethodAccessorImpl.invoke(DelegatingMethodAccessorImpl.java:25)
   at java.lang.reflect.Method.invoke(Method.java:597)
   at org.mozilla.javascript.MemberBox.invoke(MemberBox.java:155)
   at org.mozilla.javascript.NativeJavaMethod.call(NativeJavaMethod.java:243)
   at org.mozilla.javascript.optimizer.OptRuntime.call1(OptRuntime.java:66)
   at org.mozilla.javascript.gen.c6._c1(file:/Applications/alfresco/Colacem34b/tomcat6/tomcat/webapps/alfresco/WEB-INF/classes/alfresco/templates/webscripts/org/alfresco/collaboration/tagQuery.get.js:14)
   at org.mozilla.javascript.gen.c6.call(file:/Applications/alfresco/Colacem34b/tomcat6/tomcat/webapps/alfresco/WEB-INF/classes/alfresco/templates/webscripts/org/alfresco/collaboration/tagQuery.get.js)
   at org.mozilla.javascript.optimizer.OptRuntime.callName0(OptRuntime.java:108)
   at org.mozilla.javascript.gen.c6._c0(file:/Applications/alfresco/Colacem34b/tomcat6/tomcat/webapps/alfresco/WEB-INF/classes/alfresco/templates/webscripts/org/alfresco/collaboration/tagQuery.get.js:168)
   at org.mozilla.javascript.gen.c6.call(file:/Applications/alfresco/Colacem34b/tomcat6/tomcat/webapps/alfresco/WEB-INF/classes/alfresco/templates/webscripts/org/alfresco/collaboration/tagQuery.get.js)
   at org.mozilla.javascript.ContextFactory.doTopCall(ContextFactory.java:393)
   at org.mozilla.javascript.ScriptRuntime.doTopCall(ScriptRuntime.java:2834)
   at org.mozilla.javascript.gen.c6.call(file:/Applications/alfresco/Colacem34b/tomcat6/tomcat/webapps/alfresco/WEB-INF/classes/alfresco/templates/webscripts/org/alfresco/collaboration/tagQuery.get.js)
   at org.mozilla.javascript.gen.c6.exec(file:/Applications/alfresco/Colacem34b/tomcat6/tomcat/webapps/alfresco/WEB-INF/classes/alfresco/templates/webscripts/org/alfresco/collaboration/tagQuery.get.js)
   at org.alfresco.repo.jscript.RhinoScriptProcessor.executeScriptImpl(RhinoScriptProcessor.java:472)
   at org.alfresco.repo.jscript.RhinoScriptProcessor.execute(RhinoScriptProcessor.java:190)
   … 28 more
15:24:23,054  ERROR [extensions.webscripts.AbstractRuntime] Exception from executeScript - redirecting to status template error: 11220006 Wrapped Exception (with status template): 11220012 Failed to execute script 'classpath*:alfresco/templates/webscripts/org/alfresco/collaboration/tagQuery.get.js': 11220011 Invalid node ref - does not contain forward slash: null
org.springframework.extensions.webscripts.WebScriptException: 11220006 Wrapped Exception (with status template): 11220012 Failed to execute script 'classpath*:alfresco/templates/webscripts/org/alfresco/collaboration/tagQuery.get.js': 11220011 Invalid node ref - does not contain forward slash: null
   at org.springframework.extensions.webscripts.AbstractWebScript.createStatusException(AbstractWebScript.java:758)
   at org.springframework.extensions.webscripts.DeclarativeWebScript.execute(DeclarativeWebScript.java:171)
   at org.alfresco.repo.web.scripts.RepositoryContainer$2.execute(RepositoryContainer.java:383)
   at org.alfresco.repo.transaction.RetryingTransactionHelper.doInTransaction(RetryingTransactionHelper.java:381)
   at org.alfresco.repo.web.scripts.RepositoryContainer.transactionedExecute(RepositoryContainer.java:436)
   at org.alfresco.repo.web.scripts.RepositoryContainer.transactionedExecuteAs(RepositoryContainer.java:466)
   at org.alfresco.repo.web.scripts.RepositoryContainer.executeScript(RepositoryContainer.java:304)
   at org.springframework.extensions.webscripts.AbstractRuntime.executeScript(AbstractRuntime.java:333)
   at org.springframework.extensions.webscripts.AbstractRuntime.executeScript(AbstractRuntime.java:189)
   at org.springframework.extensions.webscripts.servlet.WebScriptServlet.service(WebScriptServlet.java:118)
   at javax.servlet.http.HttpServlet.service(HttpServlet.java:717)
   at org.apache.catalina.core.ApplicationFilterChain.internalDoFilter(ApplicationFilterChain.java:290)
   at org.apache.catalina.core.ApplicationFilterChain.doFilter(ApplicationFilterChain.java:206)
   at org.alfresco.web.app.servlet.GlobalLocalizationFilter.doFilter(GlobalLocalizationFilter.java:58)
   at org.apache.catalina.core.ApplicationFilterChain.internalDoFilter(ApplicationFilterChain.java:235)
   at org.apache.catalina.core.ApplicationFilterChain.doFilter(ApplicationFilterChain.java:206)
   at org.apache.catalina.core.StandardWrapperValve.invoke(StandardWrapperValve.java:233)
   at org.apache.catalina.core.StandardContextValve.invoke(StandardContextValve.java:191)
   at org.apache.catalina.core.StandardHostValve.invoke(StandardHostValve.java:127)
   at org.apache.catalina.valves.ErrorReportValve.invoke(ErrorReportValve.java:102)
   at org.apache.catalina.core.StandardEngineValve.invoke(StandardEngineValve.java:109)
   at org.apache.catalina.connector.CoyoteAdapter.service(CoyoteAdapter.java:298)
   at org.apache.coyote.http11.Http11Processor.process(Http11Processor.java:857)
   at org.apache.coyote.http11.Http11Protocol$Http11ConnectionHandler.process(Http11Protocol.java:588)
   at org.apache.tomcat.util.net.JIoEndpoint$Worker.run(JIoEndpoint.java:489)
   at java.lang.Thread.run(Thread.java:680)
Caused by: org.alfresco.scripts.ScriptException: 11220012 Failed to execute script 'classpath*:alfresco/templates/webscripts/org/alfresco/collaboration/tagQuery.get.js': 11220011 Invalid node ref - does not contain forward slash: null
   at org.alfresco.repo.jscript.RhinoScriptProcessor.execute(RhinoScriptProcessor.java:194)
   at org.alfresco.repo.processor.ScriptServiceImpl.executeScript(ScriptServiceImpl.java:282)
   at org.alfresco.repo.web.scripts.RepositoryScriptProcessor.executeScript(RepositoryScriptProcessor.java:102)
   at org.springframework.extensions.webscripts.AbstractWebScript.executeScript(AbstractWebScript.java:981)
   at org.springframework.extensions.webscripts.DeclarativeWebScript.execute(DeclarativeWebScript.java:86)
   … 24 more
Caused by: org.alfresco.error.AlfrescoRuntimeException: 11220011 Invalid node ref - does not contain forward slash: null
   at org.alfresco.service.cmr.repository.NodeRef.<init>(NodeRef.java:89)
   at org.alfresco.repo.jscript.Search.findNode(Search.java:151)
   at sun.reflect.NativeMethodAccessorImpl.invoke0(Native Method)
   at sun.reflect.NativeMethodAccessorImpl.invoke(NativeMethodAccessorImpl.java:39)
   at sun.reflect.DelegatingMethodAccessorImpl.invoke(DelegatingMethodAccessorImpl.java:25)
   at java.lang.reflect.Method.invoke(Method.java:597)
   at org.mozilla.javascript.MemberBox.invoke(MemberBox.java:155)
   at org.mozilla.javascript.NativeJavaMethod.call(NativeJavaMethod.java:243)
   at org.mozilla.javascript.optimizer.OptRuntime.call1(OptRuntime.java:66)
   at org.mozilla.javascript.gen.c6._c1(file:/Applications/alfresco/Colacem34b/tomcat6/tomcat/webapps/alfresco/WEB-INF/classes/alfresco/templates/webscripts/org/alfresco/collaboration/tagQuery.get.js:14)
   at org.mozilla.javascript.gen.c6.call(file:/Applications/alfresco/Colacem34b/tomcat6/tomcat/webapps/alfresco/WEB-INF/classes/alfresco/templates/webscripts/org/alfresco/collaboration/tagQuery.get.js)
   at org.mozilla.javascript.optimizer.OptRuntime.callName0(OptRuntime.java:108)
   at org.mozilla.javascript.gen.c6._c0(file:/Applications/alfresco/Colacem34b/tomcat6/tomcat/webapps/alfresco/WEB-INF/classes/alfresco/templates/webscripts/org/alfresco/collaboration/tagQuery.get.js:168)
   at org.mozilla.javascript.gen.c6.call(file:/Applications/alfresco/Colacem34b/tomcat6/tomcat/webapps/alfresco/WEB-INF/classes/alfresco/templates/webscripts/org/alfresco/collaboration/tagQuery.get.js)
   at org.mozilla.javascript.ContextFactory.doTopCall(ContextFactory.java:393)
   at org.mozilla.javascript.ScriptRuntime.doTopCall(ScriptRuntime.java:2834)
   at org.mozilla.javascript.gen.c6.call(file:/Applications/alfresco/Colacem34b/tomcat6/tomcat/webapps/alfresco/WEB-INF/classes/alfresco/templates/webscripts/org/alfresco/collaboration/tagQuery.get.js)
   at org.mozilla.javascript.gen.c6.exec(file:/Applications/alfresco/Colacem34b/tomcat6/tomcat/webapps/alfresco/WEB-INF/classes/alfresco/templates/webscripts/org/alfresco/collaboration/tagQuery.get.js)
   at org.alfresco.repo.jscript.RhinoScriptProcessor.executeScriptImpl(RhinoScriptProcessor.java:472)
   at org.alfresco.repo.jscript.RhinoScriptProcessor.execute(RhinoScriptProcessor.java:190)
   … 28 more
Now I'm investigating about this, it seems that there is a problem with the tagQuery.js that is one of the webscripts dedicated to the collaboration package.
Please, if you have any suggestion reply to this thread.

I'll let you know if I solve this issue.

UPDATED: this issue appears only using Google Chrome…

Outcomes