AnsweredAssumed Answered

Upload File From Bonita

Question asked by student on May 11, 2011
Latest reply on May 23, 2011 by openpj
I encountered some errors when I uploaded files from Bonita to Alfresco, the error message is as follows:

User:admin ERROR [extensions.webscripts.AbstractRuntime] Exception from executeScript - redirecting to status template error: 04110002 Wrapped Exception (with status template): 04110005 Failed to execute script 'classpath*:alfresco/templates/webscripts/org/alfresco/cmis/children.post.atom.js': Node Name is a mandatory parameter
org.springframework.extensions.webscripts.WebScriptException: 04110002 Wrapped Exception (with status template): 04110005 Failed to execute script 'classpath*:alfresco/templates/webscripts/org/alfresco/cmis/children.post.atom.js': Node Name is a mandatory parameter
   at org.springframework.extensions.webscripts.AbstractWebScript.createStatusException(AbstractWebScript.java:758)
   at org.springframework.extensions.webscripts.DeclarativeWebScript.execute(DeclarativeWebScript.java:171)
   at org.alfresco.repo.web.scripts.RepositoryContainer$2.execute(RepositoryContainer.java:383)
   at org.alfresco.repo.transaction.RetryingTransactionHelper.doInTransaction(RetryingTransactionHelper.java:381)
   at org.alfresco.repo.web.scripts.RepositoryContainer.transactionedExecute(RepositoryContainer.java:436)
   at org.alfresco.repo.web.scripts.RepositoryContainer.transactionedExecuteAs(RepositoryContainer.java:466)
   at org.alfresco.repo.web.scripts.RepositoryContainer.executeScript(RepositoryContainer.java:304)
   at org.springframework.extensions.webscripts.AbstractRuntime.executeScript(AbstractRuntime.java:333)
   at org.springframework.extensions.webscripts.AbstractRuntime.executeScript(AbstractRuntime.java:189)
   at org.springframework.extensions.webscripts.servlet.WebScriptServlet.service(WebScriptServlet.java:118)
   at javax.servlet.http.HttpServlet.service(HttpServlet.java:717)
   at org.apache.catalina.core.ApplicationFilterChain.internalDoFilter(ApplicationFilterChain.java:290)
   at org.apache.catalina.core.ApplicationFilterChain.doFilter(ApplicationFilterChain.java:206)
   at org.alfresco.web.app.servlet.GlobalLocalizationFilter.doFilter(GlobalLocalizationFilter.java:58)
   at org.apache.catalina.core.ApplicationFilterChain.internalDoFilter(ApplicationFilterChain.java:235)
   at org.apache.catalina.core.ApplicationFilterChain.doFilter(ApplicationFilterChain.java:206)
   at org.apache.catalina.core.StandardWrapperValve.invoke(StandardWrapperValve.java:233)
   at org.apache.catalina.core.StandardContextValve.invoke(StandardContextValve.java:191)
   at org.apache.catalina.core.StandardHostValve.invoke(StandardHostValve.java:127)
   at org.apache.catalina.valves.ErrorReportValve.invoke(ErrorReportValve.java:102)
   at org.apache.catalina.core.StandardEngineValve.invoke(StandardEngineValve.java:109)
   at org.apache.catalina.connector.CoyoteAdapter.service(CoyoteAdapter.java:298)
   at org.apache.coyote.http11.Http11AprProcessor.process(Http11AprProcessor.java:864)
   at org.apache.coyote.http11.Http11AprProtocol$Http11ConnectionHandler.process(Http11AprProtocol.java:579)
   at org.apache.tomcat.util.net.AprEndpoint$Worker.run(AprEndpoint.java:1665)
   at java.lang.Thread.run(Thread.java:662)
Caused by: org.alfresco.scripts.ScriptException: 04110005 Failed to execute script 'classpath*:alfresco/templates/webscripts/org/alfresco/cmis/children.post.atom.js': Node Name is a mandatory parameter
   at org.alfresco.repo.jscript.RhinoScriptProcessor.execute(RhinoScriptProcessor.java:194)
   at org.alfresco.repo.processor.ScriptServiceImpl.executeScript(ScriptServiceImpl.java:282)
   at org.alfresco.repo.web.scripts.RepositoryScriptProcessor.executeScript(RepositoryScriptProcessor.java:102)
   at org.springframework.extensions.webscripts.AbstractWebScript.executeScript(AbstractWebScript.java:981)
   at org.springframework.extensions.webscripts.DeclarativeWebScript.execute(DeclarativeWebScript.java:86)
   … 24 more
Caused by: java.lang.IllegalArgumentException: Node Name is a mandatory parameter
   at org.springframework.extensions.surf.util.ParameterCheck.mandatoryString(ParameterCheck.java:58)
   at org.alfresco.repo.jscript.ScriptNode.createFile(ScriptNode.java:1516)
   at sun.reflect.NativeMethodAccessorImpl.invoke0(Native Method)
   at sun.reflect.NativeMethodAccessorImpl.invoke(NativeMethodAccessorImpl.java:39)
   at sun.reflect.DelegatingMethodAccessorImpl.invoke(DelegatingMethodAccessorImpl.java:25)
   at java.lang.reflect.Method.invoke(Method.java:597)
   at org.mozilla.javascript.MemberBox.invoke(MemberBox.java:155)
   at org.mozilla.javascript.NativeJavaMethod.call(NativeJavaMethod.java:243)
   at org.mozilla.javascript.optimizer.OptRuntime.call1(OptRuntime.java:66)
   at org.mozilla.javascript.gen.c1._c4(file:/J:/tomcat/webapps/alfresco/WEB-INF/classes/alfresco/templates/webscripts/org/alfresco/cmis/children.post.atom.js:112)
   at org.mozilla.javascript.gen.c1.call(file:/J:/tomcat/webapps/alfresco/WEB-INF/classes/alfresco/templates/webscripts/org/alfresco/cmis/children.post.atom.js)
   at org.mozilla.javascript.optimizer.OptRuntime.callName(OptRuntime.java:97)
   at org.mozilla.javascript.gen.c1._c0(file:/J:/tomcat/webapps/alfresco/WEB-INF/classes/alfresco/templates/webscripts/org/alfresco/cmis/children.post.atom.js:550)
   at org.mozilla.javascript.gen.c1.call(file:/J:/tomcat/webapps/alfresco/WEB-INF/classes/alfresco/templates/webscripts/org/alfresco/cmis/children.post.atom.js)
   at org.mozilla.javascript.ContextFactory.doTopCall(ContextFactory.java:393)
   at org.mozilla.javascript.ScriptRuntime.doTopCall(ScriptRuntime.java:2834)
   at org.mozilla.javascript.gen.c1.call(file:/J:/tomcat/webapps/alfresco/WEB-INF/classes/alfresco/templates/webscripts/org/alfresco/cmis/children.post.atom.js)
   at org.mozilla.javascript.gen.c1.exec(file:/J:/tomcat/webapps/alfresco/WEB-INF/classes/alfresco/templates/webscripts/org/alfresco/cmis/children.post.atom.js)
   at org.alfresco.repo.jscript.RhinoScriptProcessor.executeScriptImpl(RhinoScriptProcessor.java:472)
   at org.alfresco.repo.jscript.RhinoScriptProcessor.execute(RhinoScriptProcessor.java:190)
   … 28 more
Does anyone know what caused the error?

Outcomes