AnsweredAssumed Answered

Document preview broken in 4.2.0

Question asked by zozoamam on Dec 20, 2013
Latest reply on May 27, 2014 by babt
Hi all,

I have a new 4.2.0/Ubuntu 12.04 install up and running.

When I want to preview any document, have a message: "This document can't be previewed on this server"

Have that log:

<code lang="cpp" linenumbers="normal">
17:26:59,473 ERROR [org.alfresco.repo.content.transform.TransformerConfigDynamicTransformers] Cannot create dynamic transformer transformer.complex.JodConverter.Image as sub transformers could not be found or created ("JodConverter.2Pdf|pdf|complex.PDF.Image").
17:26:59,473 ERROR [org.alfresco.repo.content.transform.TransformerConfigDynamicTransformers] Cannot create dynamic transformer transformer.complex.JodConverter.Pdf2swf as sub transformers could not be found or created ("JodConverter.2Pdf|pdf|Pdf2swf").
17:26:59,473 ERROR [org.alfresco.repo.content.transform.TransformerConfigDynamicTransformers] Cannot create dynamic transformer transformer.JodConverter.Html2Pdf as sub transformers could not be found or created ("JodConverter|odt|JodConverter").
17:26:59,473 ERROR [org.alfresco.repo.content.transform.TransformerConfigDynamicTransformers] Cannot create dynamic transformer transformer.JodConverter.2Pdf as sub transformers could not be found or created ("JodConverter|JodConverter.Html2Pdf").
17:26:59,473 ERROR [org.alfresco.repo.content.transform.TransformerConfigDynamicTransformers] Cannot create dynamic transformer transformer.complex.JodConverter.PdfBox as sub transformers could not be found or created ("JodConverter.2Pdf|pdf|PdfBox").
17:26:59,622 INFO  [org.alfresco.repo.management.subsystems.ChildApplicationContextFactory] Startup of 'Transformers' subsystem, ID: [Transformers, default] complete
17:27:02,865 ERROR [org.springframework.extensions.webscripts.AbstractRuntime] Exception from executeScript - redirecting to status template error: 11200002 Wrapped Exception (with status template): 11200009 Failed to execute script 'classpath*:alfresco/templates/webscripts/org/alfresco/repository/thumbnail/thumbnail.get.js': 11200008 Read-Write transaction started within read-only transaction
org.springframework.extensions.webscripts.WebScriptException: 11200002 Wrapped Exception (with status template): 11200009 Failed to execute script 'classpath*:alfresco/templates/webscripts/org/alfresco/repository/thumbnail/thumbnail.get.js': 11200008 Read-Write transaction started within read-only transaction
   at org.springframework.extensions.webscripts.AbstractWebScript.createStatusException(AbstractWebScript.java:1067)
   at org.alfresco.repo.web.scripts.content.StreamContent.execute(StreamContent.java:184)
   at org.alfresco.repo.web.scripts.RepositoryContainer$3.execute(RepositoryContainer.java:422)
   at org.alfresco.repo.transaction.RetryingTransactionHelper.doInTransaction(RetryingTransactionHelper.java:452)
   at org.alfresco.repo.web.scripts.RepositoryContainer.transactionedExecute(RepositoryContainer.java:491)
   at org.alfresco.repo.web.scripts.RepositoryContainer.transactionedExecuteAs(RepositoryContainer.java:529)
   at org.alfresco.repo.web.scripts.RepositoryContainer.executeScript(RepositoryContainer.java:341)
   at org.springframework.extensions.webscripts.AbstractRuntime.executeScript(AbstractRuntime.java:378)
   at org.springframework.extensions.webscripts.AbstractRuntime.executeScript(AbstractRuntime.java:209)
   at org.springframework.extensions.webscripts.servlet.WebScriptServlet.service(WebScriptServlet.java:132)
   at javax.servlet.http.HttpServlet.service(HttpServlet.java:728)
   at org.apache.catalina.core.ApplicationFilterChain.internalDoFilter(ApplicationFilterChain.java:305)
   at org.apache.catalina.core.ApplicationFilterChain.doFilter(ApplicationFilterChain.java:210)
   at org.alfresco.web.app.servlet.GlobalLocalizationFilter.doFilter(GlobalLocalizationFilter.java:61)
   at org.apache.catalina.core.ApplicationFilterChain.internalDoFilter(ApplicationFilterChain.java:243)
   at org.apache.catalina.core.ApplicationFilterChain.doFilter(ApplicationFilterChain.java:210)
   at org.apache.catalina.core.StandardWrapperValve.invoke(StandardWrapperValve.java:222)
   at org.apache.catalina.core.StandardContextValve.invoke(StandardContextValve.java:123)
   at org.apache.catalina.authenticator.AuthenticatorBase.invoke(AuthenticatorBase.java:502)
   at org.apache.catalina.core.StandardHostValve.invoke(StandardHostValve.java:171)
   at org.apache.catalina.valves.ErrorReportValve.invoke(ErrorReportValve.java:99)
   at org.apache.catalina.valves.AccessLogValve.invoke(AccessLogValve.java:953)
   at org.apache.catalina.core.StandardEngineValve.invoke(StandardEngineValve.java:118)
   at org.apache.catalina.connector.CoyoteAdapter.service(CoyoteAdapter.java:408)
   at org.apache.coyote.http11.AbstractHttp11Processor.process(AbstractHttp11Processor.java:1023)
   at org.apache.coyote.AbstractProtocol$AbstractConnectionHandler.process(AbstractProtocol.java:589)
   at org.apache.tomcat.util.net.AprEndpoint$SocketWithOptionsProcessor.run(AprEndpoint.java:1810)
   at java.util.concurrent.ThreadPoolExecutor.runWorker(ThreadPoolExecutor.java:1145)
   at java.util.concurrent.ThreadPoolExecutor$Worker.run(ThreadPoolExecutor.java:615)
   at java.lang.Thread.run(Thread.java:724)
Caused by: org.alfresco.scripts.ScriptException: 11200009 Failed to execute script 'classpath*:alfresco/templates/webscripts/org/alfresco/repository/thumbnail/thumbnail.get.js': 11200008 Read-Write transaction started within read-only transaction
   at org.alfresco.repo.jscript.RhinoScriptProcessor.execute(RhinoScriptProcessor.java:204)
   at org.alfresco.repo.processor.ScriptServiceImpl.execute(ScriptServiceImpl.java:212)
   at org.alfresco.repo.processor.ScriptServiceImpl.executeScript(ScriptServiceImpl.java:174)
   at org.alfresco.repo.web.scripts.RepositoryScriptProcessor.executeScript(RepositoryScriptProcessor.java:102)
   at org.springframework.extensions.webscripts.AbstractWebScript.executeScript(AbstractWebScript.java:1305)
   at org.alfresco.repo.web.scripts.content.StreamContent.execute(StreamContent.java:128)
   … 28 more
Caused by: org.alfresco.error.AlfrescoRuntimeException: 11200008 Read-Write transaction started within read-only transaction
   at org.alfresco.repo.transaction.RetryingTransactionHelper.doInTransaction(RetryingTransactionHelper.java:379)
   at org.alfresco.repo.transaction.RetryingTransactionInterceptor.invoke(RetryingTransactionInterceptor.java:69)
   at org.springframework.aop.framework.ReflectiveMethodInvocation.proceed(ReflectiveMethodInvocation.java:172)
   at org.springframework.aop.framework.JdkDynamicAopProxy.invoke(JdkDynamicAopProxy.java:202)
   at com.sun.proxy.$Proxy9.deleteNode(Unknown Source)
   at org.alfresco.repo.jscript.ScriptNode.remove(ScriptNode.java:1994)
   at sun.reflect.NativeMethodAccessorImpl.invoke0(Native Method)
   at sun.reflect.NativeMethodAccessorImpl.invoke(NativeMethodAccessorImpl.java:57)
   at sun.reflect.DelegatingMethodAccessorImpl.invoke(DelegatingMethodAccessorImpl.java:43)
   at java.lang.reflect.Method.invoke(Method.java:606)
   at org.mozilla.javascript.MemberBox.invoke(MemberBox.java:155)
   at org.mozilla.javascript.NativeJavaMethod.call(NativeJavaMethod.java:243)
   at org.mozilla.javascript.optimizer.OptRuntime.callProp0(OptRuntime.java:119)
   at org.mozilla.javascript.gen.c8._c1(file:/opt/alfresco-4.2.e/tomcat/webapps/alfresco/WEB-INF/classes/alfresco/templates/webscripts/org/alfresco/repository/thumbnail/thumbnail.get.js:74)
   at org.mozilla.javascript.gen.c8.call(file:/opt/alfresco-4.2.e/tomcat/webapps/alfresco/WEB-INF/classes/alfresco/templates/webscripts/org/alfresco/repository/thumbnail/thumbnail.get.js)
   at org.mozilla.javascript.optimizer.OptRuntime.callName0(OptRuntime.java:108)
   at org.mozilla.javascript.gen.c8._c0(file:/opt/alfresco-4.2.e/tomcat/webapps/alfresco/WEB-INF/classes/alfresco/templates/webscripts/org/alfresco/repository/thumbnail/thumbnail.get.js:121)
   at org.mozilla.javascript.gen.c8.call(file:/opt/alfresco-4.2.e/tomcat/webapps/alfresco/WEB-INF/classes/alfresco/templates/webscripts/org/alfresco/repository/thumbnail/thumbnail.get.js)
   at org.mozilla.javascript.ContextFactory.doTopCall(ContextFactory.java:393)
   at org.mozilla.javascript.ScriptRuntime.doTopCall(ScriptRuntime.java:2834)
   at org.mozilla.javascript.gen.c8.call(file:/opt/alfresco-4.2.e/tomcat/webapps/alfresco/WEB-INF/classes/alfresco/templates/webscripts/org/alfresco/repository/thumbnail/thumbnail.get.js)
   at org.mozilla.javascript.gen.c8.exec(file:/opt/alfresco-4.2.e/tomcat/webapps/alfresco/WEB-INF/classes/alfresco/templates/webscripts/org/alfresco/repository/thumbnail/thumbnail.get.js)
   at org.alfresco.repo.jscript.RhinoScriptProcessor.executeScriptImpl(RhinoScriptProcessor.java:502)
   at org.alfresco.repo.jscript.RhinoScriptProcessor.execute(RhinoScriptProcessor.java:200)

</code>

Can anybody help with resolving of this problem?

Outcomes