AnsweredAssumed Answered

mule build fails

Question asked by tombaeyens on Sep 27, 2010
Latest reply on Sep 27, 2010 by esteban.roblesluna
Hi Esteban,

While building the distribution with ant -f qa/build.xml test.demo.setup I get the following build error.
Can you reproduce this?  In the meantime, we'll be looking for solutions to deal with this as we're trying to can a release.


     [exec] [INFO] ————————————————————————
     [exec] [INFO] Building Activiti - Mule
     [exec] [INFO]    task-segment: [clean, install]
     [exec] [INFO] ————————————————————————
     [exec] [INFO] [clean:clean {execution: default-clean}]
     [exec] [INFO] Deleting directory /Users/tombaeyens/Documents/workspace/activiti/modules/activiti-mule/target
     [exec] [INFO] [resources:resources {execution: default-resources}]
     [exec] [WARNING] Using platform encoding (MacRoman actually) to copy filtered resources, i.e. build is platform dependent!
     [exec] [INFO] skip non existing resourceDirectory /Users/tombaeyens/Documents/workspace/activiti/modules/activiti-mule/src/main/resources
     [exec] Downloading: http://maven.alfresco.com/nexus/content/groups/public/org/apache/santuario/xmlsec/1.4.0/xmlsec-1.4.0.pom
     [exec] [INFO] Unable to find resource 'org.apache.santuario:xmlsec:pom:1.4.0' in repository alfresco (http://maven.alfresco.com/nexus/content/groups/public)
     [exec] Downloading: http://maven.alfresco.com/nexus/content/repositories/activiti-thirdparty//org/apache/santuario/xmlsec/1.4.0/xmlsec-1.4.0.pom
     [exec] [INFO] Unable to find resource 'org.apache.santuario:xmlsec:pom:1.4.0' in repository Activiti third party (http://maven.alfresco.com/nexus/content/repositories/activiti-thirdparty/)
     [exec] Downloading: http://maven.alfresco.com/nexus/content/groups/public-snapshots/org/apache/santuario/xmlsec/1.4.0/xmlsec-1.4.0.pom
     [exec] [INFO] Unable to find resource 'org.apache.santuario:xmlsec:pom:1.4.0' in repository alfresco-snapshots (http://maven.alfresco.com/nexus/content/groups/public-snapshots)
     [exec] Downloading: http://extensions.springframework.org/milestone/org/apache/santuario/xmlsec/1.4.0/xmlsec-1.4.0.pom
     [exec] [INFO] Unable to find resource 'org.apache.santuario:xmlsec:pom:1.4.0' in repository spring-extensions-milestone (http://extensions.springframework.org/milestone)
     [exec] Downloading: http://maven.restlet.org/org/apache/santuario/xmlsec/1.4.0/xmlsec-1.4.0.pom
     [exec] [INFO] Unable to find resource 'org.apache.santuario:xmlsec:pom:1.4.0' in repository maven-restlet (http://maven.restlet.org)
     [exec] Downloading: http://people.apache.org/repo/m2-incubating-repository//org/apache/santuario/xmlsec/1.4.0/xmlsec-1.4.0.pom
     [exec] [INFO] Unable to find resource 'org.apache.santuario:xmlsec:pom:1.4.0' in repository apache-incubating (http://people.apache.org/repo/m2-incubating-repository/)
     [exec] Downloading: http://download.java.net/maven/1//org.apache.santuario/poms/xmlsec-1.4.0.pom
     [exec] [INFO] Unable to find resource 'org.apache.santuario:xmlsec:pom:1.4.0' in repository java.net (http://download.java.net/maven/1/)
     [exec] Downloading: http://repository.codehaus.org/org/apache/santuario/xmlsec/1.4.0/xmlsec-1.4.0.pom
     [exec] [INFO] Unable to find resource 'org.apache.santuario:xmlsec:pom:1.4.0' in repository codehaus (http://repository.codehaus.org)
     [exec] Downloading: http://repository.ops4j.org/maven2/org/apache/santuario/xmlsec/1.4.0/xmlsec-1.4.0.pom
     [exec] [INFO] Unable to find resource 'org.apache.santuario:xmlsec:pom:1.4.0' in repository ops4j (http://repository.ops4j.org/maven2)
     [exec] Downloading: http://people.apache.org/repo/m2-incubating-repository/org/apache/santuario/xmlsec/1.4.0/xmlsec-1.4.0.pom
     [exec] [INFO] Unable to find resource 'org.apache.santuario:xmlsec:pom:1.4.0' in repository apache.incubating.releases (http://people.apache.org/repo/m2-incubating-repository)
     [exec] Downloading: http://repository.jboss.com/maven2/org/apache/santuario/xmlsec/1.4.0/xmlsec-1.4.0.pom
     [exec] [INFO] Unable to find resource 'org.apache.santuario:xmlsec:pom:1.4.0' in repository jboss (http://repository.jboss.com/maven2)
     [exec] Downloading: http://dist.codehaus.org/mule/dependencies/maven2/org/apache/santuario/xmlsec/1.4.0/xmlsec-1.4.0.pom
     [exec] [INFO] Unable to find resource 'org.apache.santuario:xmlsec:pom:1.4.0' in repository mule-deps (http://dist.codehaus.org/mule/dependencies/maven2)
     [exec] Downloading: http://ws.zones.apache.org/repository2//org/apache/santuario/xmlsec/1.4.0/xmlsec-1.4.0.pom
     [exec] [INFO] Unable to find resource 'org.apache.santuario:xmlsec:pom:1.4.0' in repository apache-ws-snapshots2 (http://ws.zones.apache.org/repository2/)
     [exec] Downloading: http://repo1.maven.org/maven2//org/apache/santuario/xmlsec/1.4.0/xmlsec-1.4.0.pom
     [exec] [INFO] Unable to find resource 'org.apache.santuario:xmlsec:pom:1.4.0' in repository maven2 (http://repo1.maven.org/maven2/)
     [exec] Downloading: http://repo1.maven.org/maven2/org/apache/santuario/xmlsec/1.4.0/xmlsec-1.4.0.pom
     [exec] [INFO] Unable to find resource 'org.apache.santuario:xmlsec:pom:1.4.0' in repository central (http://repo1.maven.org/maven2)
     [exec] Downloading: http://maven.alfresco.com/nexus/content/groups/public/opensaml/opensaml/1.1/opensaml-1.1.pom
     [exec] 0b downloaded  (opensaml-1.1.pom)
     [exec] [WARNING] *** CHECKSUM FAILED - Invalid checksum file - RETRYING
     [exec] Downloading: http://maven.alfresco.com/nexus/content/groups/public/opensaml/opensaml/1.1/opensaml-1.1.pom
     [exec] 0b downloaded  (opensaml-1.1.pom)
     [exec] [WARNING] *** CHECKSUM FAILED - Invalid checksum file - IGNORING
     [exec] [INFO] Unable to find resource 'opensaml:opensaml:pom:1.1' in repository alfresco (http://maven.alfresco.com/nexus/content/groups/public)
     [exec] Downloading: http://maven.alfresco.com/nexus/content/repositories/activiti-thirdparty//opensaml/opensaml/1.1/opensaml-1.1.pom
     [exec] [INFO] Unable to find resource 'opensaml:opensaml:pom:1.1' in repository Activiti third party (http://maven.alfresco.com/nexus/content/repositories/activiti-thirdparty/)
     [exec] Downloading: http://maven.alfresco.com/nexus/content/groups/public-snapshots/opensaml/opensaml/1.1/opensaml-1.1.pom
     [exec] [INFO] Unable to find resource 'opensaml:opensaml:pom:1.1' in repository alfresco-snapshots (http://maven.alfresco.com/nexus/content/groups/public-snapshots)
     [exec] Downloading: http://extensions.springframework.org/milestone/opensaml/opensaml/1.1/opensaml-1.1.pom
     [exec] [INFO] Unable to find resource 'opensaml:opensaml:pom:1.1' in repository spring-extensions-milestone (http://extensions.springframework.org/milestone)
     [exec] Downloading: http://maven.restlet.org/opensaml/opensaml/1.1/opensaml-1.1.pom
     [exec] [INFO] Unable to find resource 'opensaml:opensaml:pom:1.1' in repository maven-restlet (http://maven.restlet.org)
     [exec] Downloading: http://people.apache.org/repo/m2-incubating-repository//opensaml/opensaml/1.1/opensaml-1.1.pom
     [exec] [INFO] Unable to find resource 'opensaml:opensaml:pom:1.1' in repository apache-incubating (http://people.apache.org/repo/m2-incubating-repository/)
     [exec] Downloading: http://download.java.net/maven/1//opensaml/poms/opensaml-1.1.pom
     [exec] [INFO] Unable to find resource 'opensaml:opensaml:pom:1.1' in repository java.net (http://download.java.net/maven/1/)
     [exec] Downloading: http://repository.codehaus.org/opensaml/opensaml/1.1/opensaml-1.1.pom
     [exec] [INFO] Unable to find resource 'opensaml:opensaml:pom:1.1' in repository codehaus (http://repository.codehaus.org)
     [exec] Downloading: http://repository.ops4j.org/maven2/opensaml/opensaml/1.1/opensaml-1.1.pom
     [exec] [INFO] Unable to find resource 'opensaml:opensaml:pom:1.1' in repository ops4j (http://repository.ops4j.org/maven2)
     [exec] Downloading: http://people.apache.org/repo/m2-incubating-repository/opensaml/opensaml/1.1/opensaml-1.1.pom
     [exec] [INFO] Unable to find resource 'opensaml:opensaml:pom:1.1' in repository apache.incubating.releases (http://people.apache.org/repo/m2-incubating-repository)
     [exec] Downloading: http://repository.jboss.com/maven2/opensaml/opensaml/1.1/opensaml-1.1.pom
     [exec] [INFO] Unable to find resource 'opensaml:opensaml:pom:1.1' in repository jboss (http://repository.jboss.com/maven2)
     [exec] Downloading: http://dist.codehaus.org/mule/dependencies/maven2/opensaml/opensaml/1.1/opensaml-1.1.pom
     [exec] [INFO] Unable to find resource 'opensaml:opensaml:pom:1.1' in repository mule-deps (http://dist.codehaus.org/mule/dependencies/maven2)
     [exec] Downloading: http://ws.zones.apache.org/repository2//opensaml/opensaml/1.1/opensaml-1.1.pom
     [exec] [INFO] Unable to find resource 'opensaml:opensaml:pom:1.1' in repository apache-ws-snapshots2 (http://ws.zones.apache.org/repository2/)
     [exec] Downloading: http://repo1.maven.org/maven2//opensaml/opensaml/1.1/opensaml-1.1.pom
     [exec] [INFO] Unable to find resource 'opensaml:opensaml:pom:1.1' in repository maven2 (http://repo1.maven.org/maven2/)
     [exec] Downloading: http://repo1.maven.org/maven2/opensaml/opensaml/1.1/opensaml-1.1.pom
     [exec] [INFO] Unable to find resource 'opensaml:opensaml:pom:1.1' in repository central (http://repo1.maven.org/maven2)
     [exec] Downloading: http://maven.alfresco.com/nexus/content/groups/public/org/safehaus/jug/jug/2.0.0-osgi/jug-2.0.0-osgi.pom
     [exec] 0b downloaded  (jug-2.0.0-osgi.pom)
     [exec] [WARNING] *** CHECKSUM FAILED - Error retrieving checksum file for org/safehaus/jug/jug/2.0.0-osgi/jug-2.0.0-osgi.pom - IGNORING
     [exec] [INFO] Unable to find resource 'org.safehaus.jug:jug:pom:2.0.0-osgi' in repository alfresco (http://maven.alfresco.com/nexus/content/groups/public)
     [exec] Downloading: http://maven.alfresco.com/nexus/content/repositories/activiti-thirdparty//org/safehaus/jug/jug/2.0.0-osgi/jug-2.0.0-osgi.pom
     [exec] [INFO] Unable to find resource 'org.safehaus.jug:jug:pom:2.0.0-osgi' in repository Activiti third party (http://maven.alfresco.com/nexus/content/repositories/activiti-thirdparty/)
     [exec] Downloading: http://maven.alfresco.com/nexus/content/groups/public-snapshots/org/safehaus/jug/jug/2.0.0-osgi/jug-2.0.0-osgi.pom
     [exec] [INFO] Unable to find resource 'org.safehaus.jug:jug:pom:2.0.0-osgi' in repository alfresco-snapshots (http://maven.alfresco.com/nexus/content/groups/public-snapshots)
     [exec] Downloading: http://extensions.springframework.org/milestone/org/safehaus/jug/jug/2.0.0-osgi/jug-2.0.0-osgi.pom
     [exec] [INFO] Unable to find resource 'org.safehaus.jug:jug:pom:2.0.0-osgi' in repository spring-extensions-milestone (http://extensions.springframework.org/milestone)
     [exec] Downloading: http://maven.restlet.org/org/safehaus/jug/jug/2.0.0-osgi/jug-2.0.0-osgi.pom
     [exec] [INFO] Unable to find resource 'org.safehaus.jug:jug:pom:2.0.0-osgi' in repository maven-restlet (http://maven.restlet.org)
     [exec] Downloading: http://people.apache.org/repo/m2-incubating-repository//org/safehaus/jug/jug/2.0.0-osgi/jug-2.0.0-osgi.pom
     [exec] [INFO] Unable to find resource 'org.safehaus.jug:jug:pom:2.0.0-osgi' in repository apache-incubating (http://people.apache.org/repo/m2-incubating-repository/)
     [exec] Downloading: http://download.java.net/maven/1//org.safehaus.jug/poms/jug-2.0.0-osgi.pom
     [exec] [INFO] Unable to find resource 'org.safehaus.jug:jug:pom:2.0.0-osgi' in repository java.net (http://download.java.net/maven/1/)
     [exec] Downloading: http://repository.codehaus.org/org/safehaus/jug/jug/2.0.0-osgi/jug-2.0.0-osgi.pom
     [exec] [INFO] Unable to find resource 'org.safehaus.jug:jug:pom:2.0.0-osgi' in repository codehaus (http://repository.codehaus.org)
     [exec] Downloading: http://repository.ops4j.org/maven2/org/safehaus/jug/jug/2.0.0-osgi/jug-2.0.0-osgi.pom
     [exec] [INFO] Unable to find resource 'org.safehaus.jug:jug:pom:2.0.0-osgi' in repository ops4j (http://repository.ops4j.org/maven2)
     [exec] Downloading: http://people.apache.org/repo/m2-incubating-repository/org/safehaus/jug/jug/2.0.0-osgi/jug-2.0.0-osgi.pom
     [exec] [INFO] Unable to find resource 'org.safehaus.jug:jug:pom:2.0.0-osgi' in repository apache.incubating.releases (http://people.apache.org/repo/m2-incubating-repository)
     [exec] Downloading: http://repository.jboss.com/maven2/org/safehaus/jug/jug/2.0.0-osgi/jug-2.0.0-osgi.pom
     [exec] [INFO] Unable to find resource 'org.safehaus.jug:jug:pom:2.0.0-osgi' in repository jboss (http://repository.jboss.com/maven2)
     [exec] Downloading: http://dist.codehaus.org/mule/dependencies/maven2/org/safehaus/jug/jug/2.0.0-osgi/jug-2.0.0-osgi.pom
     [exec] [INFO] Unable to find resource 'org.safehaus.jug:jug:pom:2.0.0-osgi' in repository mule-deps (http://dist.codehaus.org/mule/dependencies/maven2)
     [exec] Downloading: http://repo1.maven.org/maven2/org/safehaus/jug/jug/2.0.0-osgi/jug-2.0.0-osgi.pom
     [exec] [INFO] Unable to find resource 'org.safehaus.jug:jug:pom:2.0.0-osgi' in repository central (http://repo1.maven.org/maven2)
     [exec] [INFO] [compiler:compile {execution: default-compile}]
     [exec] [INFO] Nothing to compile - all classes are up to date
     [exec] [INFO] [resources:testResources {execution: default-testResources}]
     [exec] [WARNING] Using platform encoding (MacRoman actually) to copy filtered resources, i.e. build is platform dependent!
     [exec] [INFO] Copying 3 resources
     [exec] [INFO] [compiler:testCompile {execution: default-testCompile}]
     [exec] [INFO] Compiling 5 source files to /Users/tombaeyens/Documents/workspace/activiti/modules/activiti-mule/target/test-classes
     [exec] [INFO] [surefire:test {execution: default-test}]
     [exec] [INFO] Surefire report directory: /Users/tombaeyens/Documents/workspace/activiti/modules/activiti-mule/target/surefire-reports
     [exec] ——————————————————-
     [exec]  T E S T S
     [exec] ——————————————————-
     [exec] Running org.activiti.engine.test.bpmn.servicetask.WebServiceTaskTest
     [exec] Tests run: 1, Failures: 0, Errors: 1, Skipped: 0, Time elapsed: 3.972 sec <<< FAILURE!
     [exec] Running org.activiti.test.mule.CxfSyncWebServiceClientIntegrationTest
     [exec] Tests run: 5, Failures: 0, Errors: 0, Skipped: 0, Time elapsed: 16.751 sec
     [exec] Results :
     [exec] Tests in error:
     [exec]   testWebServiceInvocationWithoutDataFlow(org.activiti.engine.test.bpmn.servicetask.WebServiceTaskTest)
     [exec] Tests run: 6, Failures: 0, Errors: 1, Skipped: 0
     [exec] [INFO] ————————————————————————
     [exec] [ERROR] BUILD FAILURE
     [exec] [INFO] ————————————————————————

Outcomes