AnsweredAssumed Answered

how to resolve Running an Integration Test with Share problem?

Question asked by savita on Sep 27, 2017
I'm following the Alfresco Developer Series Tutorials tutorial from Jpotts.
gave error in Running an Integration Test with Share.
I would like to know how to solve this problem. I attached an image that shows the error.

 

 

 

Downloaded: https://repo.maven.apache.org/maven2/org/sonatype/sisu/sisu-guava/0.
9.9/sisu-guava-0.9.9.jar (1.5 MB at 40 kB/s)
[INFO] Copying and filtering alfresco-global-*.properties files to target/test-c
lasses
[INFO] Using 'UTF-8' encoding to copy filtered resources.
[INFO] skip non existing resourceDirectory C:\Users\HP\Documents\Alfresco_exempl
o\isptec-mvn-tutorial-share\src\test\properties\${env}
[INFO] ------------------------------------------------------------------------
[INFO] BUILD FAILURE
[INFO] ------------------------------------------------------------------------
[INFO] Total time: 44:44 min
[INFO] Finished at: 2017-05-24T22:03:45+01:00
[INFO] Final Memory: 24M/83M
[INFO] ------------------------------------------------------------------------
[ERROR] Failed to execute goal org.alfresco.maven.plugin:alfresco-maven-plugin:3
.0.0-beta-4:run (default-cli) on project isptec-mvn-tutorial-share: Invalid data
base configuration, use enableH2, enableMySQL, enablePostgreSQL, or enabaleEnter
priseDb -> [Help 1]
[ERROR]
[ERROR] To see the full stack trace of the errors, re-run Maven with the -e swit
ch.
[ERROR] Re-run Maven using the -X switch to enable full debug logging.
[ERROR]
[ERROR] For more information about the errors and possible solutions, please rea
d the following articles:
[ERROR] [Help 1] http://cwiki.apache.org/confluence/display/MAVEN/MojoExecutionE
xception

Outcomes